CPanel suhosin install failed

/scripts/phpextensionmgr install PHPSuHosin
Updating md5sum list
Fetching http://httpupdate.cpanel.net/cpanelsync/easy/targz.yaml (connected:0).......(request attempt 1/12)...Resolving httpupdate.cpanel.net...(resolve attempt 1/65)...
    Fetching http://httpupdate.cpanel.net/mirror_addr_list (connected:0).......(request attempt 1/3)......connecting to 74.50.120.123...@74.50.120.123......connected......receiving...100%......request success......Done
...found 43 host(s) from mirror_addr_list......searching for mirrors (mirror search attempt 1/3)...Testing connection speed for httpupdate.cpanel.net (43 servers)...(using fast method)...............................................Done
Ping:3 (ticks) Testing connection speed to 216.12.197.42 using pureperl...(556922.22 bytes/s)...Done
Ping:16 (ticks) Testing connection speed to 122.201.72.171 using pureperl...(126894.94 bytes/s)...Done
Ping:17 (ticks) Testing connection speed to 208.82.118.100 using pureperl...(101259.60 bytes/s)...Done
Ping:17 (ticks) Testing connection speed to 64.50.161.11 using pureperl...(115226.44 bytes/s)...Done
Ping:18 (ticks) Testing connection speed to 208.43.129.162 using pureperl...(110160.44 bytes/s)...Done
Ping:18 (ticks) Testing connection speed to 69.50.192.73 using pureperl...(108963.04 bytes/s)...Done
Ping:19 (ticks) Testing connection speed to 209.188.92.54 using pureperl...(98281.37 bytes/s)...Done
Ping:20 (ticks) Testing connection speed to 74.50.120.123 using pureperl...(80196.80 bytes/s)...Done
Ping:20 (ticks) Testing connection speed to 75.126.236.226 using pureperl...(101259.60 bytes/s)...Done
10 usable mirrors located
...mirror search success...@74.50.120.123......connected......receiving...100%......request success......Done
Downloading tarball for PHPSuHosin
Fetching http://httpupdate.cpanel.net/cpanelsync/easy/targz/Cpanel/Easy/PHPSuHosin.pm.tar.gz (connected:0).......(request attempt 1/12)...Using dns cache file /root/.HttpRequest/httpupdate.cpanel.net......searching for mirrors (mirror search attempt 1/3)......loaded mirror speeds from cache......mirror search success......connecting to 216.12.197.42...@216.12.197.42......connected......receiving...58%...100%......request success......Done
Installing PHPSuHosin
Determining PHP version
Configuring for:
PHP Api Version:         20100412
Zend Module Api No:      20100525
Zend Extension Api No:   220100525
checking for grep that handles long lines and -e... /bin/grep
checking for egrep... /bin/grep -E
checking for a sed that does not truncate output... /bin/sed
checking for cc... cc
checking for C compiler default output file name... a.out
checking whether the C compiler works... yes
checking whether we are cross compiling... no
checking for suffix of executables...
checking for suffix of object files... o
checking whether we are using the GNU C compiler... yes
checking whether cc accepts -g... yes
checking for cc option to accept ISO C89... none needed
checking how to run the C preprocessor... cc -E
checking for icc... no
checking for suncc... no
checking whether cc understands -c and -o together... yes
checking for system library directory... lib
checking if compiler supports -R... no
checking if compiler supports -Wl,-rpath,... yes
checking build system type... i686-pc-linux-gnu
checking host system type... i686-pc-linux-gnu
checking target system type... i686-pc-linux-gnu
checking for PHP prefix... /usr/local
checking for PHP includes... -I/usr/local/include/php -I/usr/local/include/php/main -I/usr/local/include/php/TSRM -I/usr/local/include/php/Zend -I/usr/local/include/php/ext -I/usr/local/include/php/ext/date/lib
checking for PHP extension directory... /usr/local/lib/php/extensions/no-debug-non-zts-20100525
checking for PHP installed headers prefix... /usr/local/include/php
checking if debug is enabled... no
checking if zts is enabled... no
checking for re2c... no
configure: WARNING: You will need re2c 0.13.4 or later if you want to regenerate PHP parsers.
checking for gawk... gawk
checking whether to enable suhosin support... yes, shared
checking for ld used by cc... /usr/bin/ld
checking if the linker (/usr/bin/ld) is GNU ld... yes
checking for /usr/bin/ld option to reload object files... -r
checking for BSD-compatible nm... /usr/bin/nm -B
checking whether ln -s works... yes
checking how to recognize dependent libraries... pass_all
checking for ANSI C header files... yes
checking for sys/types.h... yes
checking for sys/stat.h... yes
checking for stdlib.h... yes
checking for string.h... yes
checking for memory.h... yes
checking for strings.h... yes
checking for inttypes.h... yes
checking for stdint.h... yes
checking for unistd.h... yes
checking dlfcn.h usability... yes
checking dlfcn.h presence... yes
checking for dlfcn.h... yes
checking the maximum length of command line arguments... 1966080
checking command to parse /usr/bin/nm -B output from cc object... ok
checking for objdir... .libs
checking for ar... ar
checking for ranlib... ranlib
checking for strip... strip
checking if cc supports -fno-rtti -fno-exceptions... no
checking for cc option to produce PIC... -fPIC
checking if cc PIC flag -fPIC works... yes
checking if cc static flag -static works... yes
checking if cc supports -c -o file.o... yes
checking whether the cc linker (/usr/bin/ld) supports shared libraries... yes
checking whether -lc should be explicitly linked in... no
checking dynamic linker characteristics... GNU/Linux ld.so
checking how to hardcode library paths into programs... immediate
checking whether stripping libraries is possible... yes
checking if libtool supports shared libraries... yes
checking whether to build shared libraries... yes
checking whether to build static libraries... no

creating libtool
appending configuration tag "CXX" to libtool
configure: creating ./config.status
config.status: creating config.h
find . -name \*.gcno -o -name \*.gcda | xargs rm -f
find . -name \*.lo -o -name \*.o | xargs rm -f
find . -name \*.la -o -name \*.a | xargs rm -f
find . -name \*.so | xargs rm -f
find . -name .libs -a -type d|xargs rm -rf
rm -f libphp.la   modules/* libs/*
/bin/sh /home/cpeasyapache/phpextensions/suhosin/suhosin-0.9.33/libtool --mode=compile cc  -I. -I/home/cpeasyapache/phpextensions/suhosin/suhosin-0.9.33 -DPHP_ATOM_INC -I/home/cpeasyapache/phpextensions/suhosin/suhosin-0.9.33/include -I/home/cpeasyapache/phpextensions/suhosin/suhosin-0.9.33/main -I/home/cpeasyapache/phpextensions/suhosin/suhosin-0.9.33 -I/usr/local/include/php -I/usr/local/include/php/main -I/usr/local/include/php/TSRM -I/usr/local/include/php/Zend -I/usr/local/include/php/ext -I/usr/local/include/php/ext/date/lib  -DHAVE_CONFIG_H  -g -O2   -c /home/cpeasyapache/phpextensions/suhosin/suhosin-0.9.33/suhosin.c -o suhosin.lo
mkdir .libs
 cc -I. -I/home/cpeasyapache/phpextensions/suhosin/suhosin-0.9.33 -DPHP_ATOM_INC -I/home/cpeasyapache/phpextensions/suhosin/suhosin-0.9.33/include -I/home/cpeasyapache/phpextensions/suhosin/suhosin-0.9.33/main -I/home/cpeasyapache/phpextensions/suhosin/suhosin-0.9.33 -I/usr/local/include/php -I/usr/local/include/php/main -I/usr/local/include/php/TSRM -I/usr/local/include/php/Zend -I/usr/local/include/php/ext -I/usr/local/include/php/ext/date/lib -DHAVE_CONFIG_H -g -O2 -c /home/cpeasyapache/phpextensions/suhosin/suhosin-0.9.33/suhosin.c  -fPIC -DPIC -o .libs/suhosin.o
/home/cpeasyapache/phpextensions/suhosin/suhosin-0.9.33/suhosin.c: In function ‘suhosin_register_cookie_variable’:
/home/cpeasyapache/phpextensions/suhosin/suhosin-0.9.33/suhosin.c:649: error: ‘struct _php_core_globals’ has no member named ‘magic_quotes_gpc’
/home/cpeasyapache/phpextensions/suhosin/suhosin-0.9.33/suhosin.c:686: error: ‘struct _php_core_globals’ has no member named ‘magic_quotes_gpc’
/home/cpeasyapache/phpextensions/suhosin/suhosin-0.9.33/suhosin.c: In function ‘suhosin_register_cookie_variable_safe’:
/home/cpeasyapache/phpextensions/suhosin/suhosin-0.9.33/suhosin.c:717: error: ‘struct _php_core_globals’ has no member named ‘magic_quotes_gpc’
make: *** [suhosin.lo] Error 1
Determining PHP version
Could not determine PHP version from output:
 


Tags:

cpanel, suhosin, install, scripts, phpextensionmgr, phpsuhosin, updating, md, sum, fetching, http, httpupdate, cpanelsync, targz, yaml, resolving, resolve, mirror_addr_list, connecting, receiving, mirrors, servers, method, ping, ticks, pureperl, bytes, usable, located, downloading, tarball, pm, tar, gz, dns, cache, httprequest, speeds, installing, determining, php, configuring, api, zend, module, extension, grep, handles, bin, egrep, sed, truncate, output, cc, compiler, default, compiling, suffix, executables, gnu, accepts, iso, preprocessor, icc, suncc, directory, lib, supports, wl, rpath, pc, linux, prefix, usr, includes, tsrm, ext, extensions, debug, zts, installed, headers, enabled, configure, regenerate, parsers, gawk, enable, ld, linker, reload, bsd, compatible, nm, ln, libraries, pass_all, ansi, header, sys, stat, stdlib, inttypes, stdint, unistd, dlfcn, usability, maximum, length, arguments, parse, ok, objdir, libs, ar, ranlib, fno, rtti, exceptions, pic, fpic, static, lc, explicitly, linked, dynamic, characteristics, hardcode, paths, programs, stripping, libtool, creating, appending, configuration, quot, cxx, config, gcno, gcda, xargs, rm, rf, libphp, modules, sh, cpeasyapache, phpextensions, mode, compile, dphp_atom_inc, dhave_config_h, mkdir, dpic, lsquo, suhosin_register_cookie_variable, rsquo, struct, _php_core_globals, magic_quotes_gpc, suhosin_register_cookie_variable_safe, determine,

Latest Articles

  • How To Install OpenProject on Centos 7 Step-by-Step Guide
  • Ubuntu Debian Linux Cannot Install Wine Solution - wine1.6 : Depends: wine1.6-i386 (= 1:1.6.2-0ubuntu14.2) but it is not installable wine1.4 : Depends: wine1.6 but it is not going to be installed
  • How To Install python 3.4 3.5 and up on Linux with wine - Working Solution
  • using Xvfb on virtual remote ssh server to have X graphical programs work
  • ssh Received disconnect from port 22:2: Too many authentication failures
  • named bind errors - DNSKEY: unable to find a DNSKEY which verifies the DNSKEY RRset and also matches a trusted key for '.'
  • OpenVZ vs LXC DIR mode poor security in LXC
  • httpd: Syntax error on line 221 of /etc/httpd/conf/httpd.conf: Syntax error on line 6 of /etc/httpd/conf.d/php.conf: Cannot load modules/libphp5.so into server: /lib64/libresolv.so.2: symbol __h_errno, version GLIBC_PRIVATE not defined in file libc.s
  • Radeon R3 GPU on Debian Crashing
  • MySQL 5.7 on Debian and Ubuntu - How To Reset Root Password
  • SSH and sshfs timeout settings keepalive
  • Linux How To Add User To Additional Group
  • Howto Set Static IP on boot in initramfs for dropbear or other purposes NFS, Linux, Debian, Ubuntu, CentOS
  • Convert and install to LUKS Encrypted Drive Ubuntu 18.04 19.10 Linux Mint and Debian Based Linux
  • Debian and Netplan
  • CentOS 8 how to restart the network!
  • CentOS 8 how to convert to a bootable mdadm RAID software array
  • ADATA USB Thumb Drive Issues
  • KMODE EXCEPTION NOT HANDLED - QEMU/KVM Won't Boot Windows 2016 or 10 Image or Physical Machine
  • Linux Mint / Ubuntu / Debian Mate Disable Guest Session and Hide Usernames on Lightdm Login screen GUI