Centos and obfsproxy install errors -

Centos and obfsproxy install errors

pip install obfsproxy
/usr/lib/python2.6/site-packages/pip/_vendor/requests/packages/urllib3/util/ssl_.py:90: InsecurePlatformWarning: A true SSLContext object is not available. This prevents urllib3 from configuring SSL appropriately and may cause certain SSL connections to fail. For more information, see https://urllib3.readthedocs.org/en/latest/security.html#insecureplatformwarning.
  InsecurePlatformWarning
You are using pip version 7.1.0, however version 8.1.1 is available.
You should consider upgrading via the 'pip install --upgrade pip' command.
Collecting obfsproxy
/usr/lib/python2.6/site-packages/pip/_vendor/requests/packages/urllib3/util/ssl_.py:90: InsecurePlatformWarning: A true SSLContext object is not available. This prevents urllib3 from configuring SSL appropriately and may cause certain SSL connections to fail. For more information, see https://urllib3.readthedocs.org/en/latest/security.html#insecureplatformwarning.
  InsecurePlatformWarning
  Downloading obfsproxy-0.2.13.tar.gz (93kB)
    100% |████████████████████████████████| 94kB 39kB/s
Requirement already satisfied (use --upgrade to upgrade): setuptools in /usr/lib/python2.6/site-packages (from obfsproxy)
Collecting PyCrypto (from obfsproxy)
  Downloading pycrypto-2.6.1.tar.gz (446kB)
    100% |████████████████████████████████| 446kB 259kB/s
Collecting Twisted (from obfsproxy)
  Downloading Twisted-16.1.1.tar.bz2 (2.9MB)
    100% |████████████████████████████████| 2.9MB 95kB/s
    Complete output from command python setup.py egg_info:
    Traceback (most recent call last):
      File "<string>", line 20, in <module>
      File "/tmp/pip-build-7aeuJC/Twisted/setup.py", line 57, in <module>
        main(sys.argv[1:])
      File "/tmp/pip-build-7aeuJC/Twisted/setup.py", line 36, in main
        from twisted.python.dist import (
      File "./twisted/__init__.py", line 55, in <module>
        _checkRequirements()
      File "./twisted/__init__.py", line 17, in _checkRequirements
        raise ImportError("Twisted requires Python 2.7 or later.")
    ImportError: Twisted requires Python 2.7 or later.

#try again after installing these packages
yum -y install python-crypto gcc make

pip install obfsproxy
#same result as before
 ImportError: Twisted requires Python 2.7 or later.

#there is no python 2.7 package for Centos 6

#build it ourselves


  • bash Linux how to get first or last letters of a word
  • l2tp ipsec VPN Error Sep 12 18:16:25 vps pluto[7299]: ERROR: asynchronous network error report on eth0 (sport=500) for message to 192.5.6.2 port 20640, complainant 192.5.6.2: Connection refused [errno 111, origin ICMP type 3 code 3 (not authenticated
  • Centos 5.9 Working Vault Repo file
  • Disable SSH Password Authentication to Increase Security and Harden SSH Linux Unix Server Ubuntu Mint Centos Debian
  • ecryptfs how to mount or recover from a backup
  • Linux bash script to see what connected computers respond to ping
  • rsync specify alternate port non-standard port than 22
  • Centos 6.6/6.9 KVM VM Kernel Panic On Boot - Kernel panic - not syncing: Attempted to kill init!
  • Cannot allocate TUN/TAP dev dynamically - FreeBSD/OpenBSD OpenVPN Client error Solution
  • Linux Mint/Ubuntu/Debian apt how to downgrade a package
  • Ubuntu Linux Mint How To Exclude Stop Package from being Upgraded or Installed
  • Intel NUC Lower Power Green Computing Boxes Review/Comparison of J3160 and J3455 Models
  • How to backup entire computer Linux Mint Ubuntu with tar
  • tar how to ignore failed reads and not exit
  • kdenlive titles/text renders as white screen when using .sh script
  • [1035724.274610] [drm:intel_pipe_update_end [i915_bpo]] *ERROR* Atomic update failure on pipe A (start=62076478 end=62076479) time 102 us, min 894, max 899, scanline start 893, end 900 W: Possible missing firmware /lib/firmware/i915/kbl_dmc_ver1.bin
  • ffmpeg how to watermark and concatenate in one command
  • /usr/bin/ld: cannot find -lboost_system-mt-s /usr/bin/ld: cannot find -lboost_filesystem-mt-s /usr/bin/ld: cannot find -lboost_program_options-mt-s /usr/bin/ld: cannot find -lboost_thread-mt-s collect2: error: ld returned 1 exit status make: *** [cag
  • Wine uninstalled broken on Linux Mint
  • ffmpeg trouble concatenating similar but different files