/usr/bin/ld: cannot find -lboost_system-mt-s /usr/bin/ld: cannot find -lboost_filesystem-mt-s /usr/bin/ld: cannot find -lboost_program_options-mt-s /usr/bin/ld: cannot find -lboost_thread-mt-s collect2: error: ld returned 1 exit status make: *** [cag

cagecoin linux compile:


sudo apt-get install qt4-qmake libqt4-dev build-essential libboost-dev libboost-system-dev \
        libboost-filesystem-dev libboost-program-options-dev libboost-thread-dev \
        libssl-dev libdb++-dev libminiupnpc-dev

Solution:

 sed -i s/"BOOST_LIB_SUFFIX=-mt-s"/"#BOOST_LIB_SUFFIX=-mt-s"/ cagecoin-qt.pro
 



qmake
make

 -L/home/ubuntu/build/openssl-1.0.1g -lssl -lcrypto -ldb_cxx -lboost_system-mt-s -lboost_filesystem-mt-s -lboost_program_options-mt-s -lboost_thread-mt-s -lQtGui -lQtCore -lpthread
/usr/bin/ld: cannot find -lboost_system-mt-s
/usr/bin/ld: cannot find -lboost_filesystem-mt-s
/usr/bin/ld: cannot find -lboost_program_options-mt-s
/usr/bin/ld: cannot find -lboost_thread-mt-s
collect2: error: ld returned 1 exit status
make: *** [cagecoin-qt] Error 1

#troubleshoot
 ld -lboost_system-mt-s --verbose



libboost-filesystem-dev
libboost-system-dev
libboost-program-options-dev
libboost-thread-dev
attempt to open /usr/x86_64-linux-gnu/lib64/libboost_system-mt-s.so failed
attempt to open /usr/x86_64-linux-gnu/lib64/libboost_system-mt-s.a failed
attempt to open //usr/local/lib/x86_64-linux-gnu/libboost_system-mt-s.so failed
attempt to open //usr/local/lib/x86_64-linux-gnu/libboost_system-mt-s.a failed
attempt to open //usr/local/lib64/libboost_system-mt-s.so failed
attempt to open //usr/local/lib64/libboost_system-mt-s.a failed
attempt to open //lib/x86_64-linux-gnu/libboost_system-mt-s.so failed
attempt to open //lib/x86_64-linux-gnu/libboost_system-mt-s.a failed
attempt to open //lib64/libboost_system-mt-s.so failed
attempt to open //lib64/libboost_system-mt-s.a failed
attempt to open //usr/lib/x86_64-linux-gnu/libboost_system-mt-s.so failed
attempt to open //usr/lib/x86_64-linux-gnu/libboost_system-mt-s.a failed
attempt to open //usr/lib64/libboost_system-mt-s.so failed
attempt to open //usr/lib64/libboost_system-mt-s.a failed
attempt to open //usr/local/lib/libboost_system-mt-s.so failed
attempt to open //usr/local/lib/libboost_system-mt-s.a failed
attempt to open //lib/libboost_system-mt-s.so failed
attempt to open //lib/libboost_system-mt-s.a failed
attempt to open //usr/lib/libboost_system-mt-s.so failed
attempt to open //usr/lib/libboost_system-mt-s.a failed
ld: cannot find -lboost_system-mt-s



sudo apt-get install qt4-default qt4-qmake libqt4-dev build-essential libboost-dev libboost-system-dev libboost-filesystem-dev libboost-program-options-dev libboost-thread-dev libdb++-dev libssl-dev libminiupnpc-dev libminiupnpc8
 

Latest Articles

  • prosody xmpp server "Failed in all attempts to connect to proxy.eu.jabber.org"
  • VMWare ESXi 6.7 SSH/PowerShell CLI Commands
  • VMWare Vsphere VCSA Graphical Install Creates json
  • error while loading shared libraries: libasound.so.2: cannot open shared object file: No such file or directory
  • ./xmr-stak: error while loading shared libraries: libmicrohttpd.so.10: cannot open shared object file: No such file or directory
  • qemu-img resize howto
  • gmail.com address failing in Postfix
  • VMWare Hardware virtualization is selected and cannot be deselected due to selection of VBS Insufficient resources to satisfy configured failover level for vSphere HA.
  • Debian Mint Ubuntu compiling xmr-stak
  • ./nsgpucnminer: error while loading shared libraries: libOpenCL.so.1w: cannot open shared object file: No such file or directory
  • *** These critical programs are missing or too old: gawk
  • migration/4 migration 4 is using too much CPU
  • convert.im6: Unknown field with tag 317 (0x13d) encountered. `TIFFReadDirectory' @ warning/tiff.c/TIFFWarnings/788.
  • Python SyntaxError: Missing parentheses in call to 'print'
  • Linux How To Rename Files
  • OpenVZ container will not stop Child 546246 exited with status 1
  • [warn] VirtualHost 10.2.5.101:443 overlaps with VirtualHost 10.2.5.101:443, the first has precedence, perhaps you need a NameVirtualHost directive
  • Ethereum Client Errors
  • PayPal IPN Failed "result: IPN Handshake Invalid"
  • Linux Centos 7 HowTo Install Yarn