Kernel linux-2.6.39 In file included from drivers/block/cciss.c:1015: include/asm-generic/pci-dma-compat.h: In function `cmd_special_free': drivers/block/cciss.c:196: sorry, unimplemented: inlining failed in call to 'cciss_tag_discard_error_bits': fu

In file included from drivers/block/cciss.c:1015:
include/asm-generic/pci-dma-compat.h: In function `cmd_special_free':
drivers/block/cciss.c:196: sorry, unimplemented: inlining failed in call to 'cciss_tag_discard_error_bits': function body not available
include/asm-generic/pci-dma-compat.h:25: sorry, unimplemented: called from here
make[2]: *** [drivers/block/cciss.o] Error 1
make[1]: *** [drivers/block] Error 2
make: *** [drivers] Error 2

Once again with a new kernel "linux-2.6.39" another huge bug.


Tags:

kernel, linux, included, drivers, cciss, asm, generic, pci, dma, compat, cmd_special_free, unimplemented, inlining, cciss_tag_discard_error_bits, fuin, quot,

Latest Articles

  • virt-resize: error: libguestfs error: could not create appliance through libvirt.
  • Asterisk Does Not Retry When Authentication Fails
  • Linux Debian Ubuntu How To Install PEPPER Faster and Latest Adobe Flash Player in Firefox
  • How To Speed Up Linux Ubuntu and Debian Based Computers By Improving CPU Performance and Changing the CPU Governor
  • Convert data or file to base64 on a single line
  • Linux Mint Ubuntu Debian radeon slow 2D performance issues radeon_dp_aux_transfer_native: 158 callbacks suppressed
  • mdadm: super0.90 cannot open /dev/sdb1: Device or resource busy mdadm: /dev/sdb1 is not suitable for this array.
  • How To Install NextCloud on Centos 7 and Centos 8
  • AH01630: client denied by server configuration:
  • ERROR: Could not find a version that satisfies the requirement PIL (from versions: none) ERROR: No matching distribution found for PIL
  • ZTE Camera Cannot Work unable to connect to camera. Camera has been disabled becaue of security policies or is being used by other apps
  • QEMU KVM how to boot off a physical CD/DVD/BDROM Drive
  • How To Install OpenProject on Centos 7 Step-by-Step Guide
  • Ubuntu Debian Linux Cannot Install Wine Solution - wine1.6 : Depends: wine1.6-i386 (= 1:1.6.2-0ubuntu14.2) but it is not installable wine1.4 : Depends: wine1.6 but it is not going to be installed
  • How To Install python 3.4 3.5 and up on Linux with wine - Working Solution
  • using Xvfb on virtual remote ssh server to have X graphical programs work
  • ssh Received disconnect from port 22:2: Too many authentication failures
  • named bind errors - DNSKEY: unable to find a DNSKEY which verifies the DNSKEY RRset and also matches a trusted key for '.'
  • OpenVZ vs LXC DIR mode poor security in LXC
  • httpd: Syntax error on line 221 of /etc/httpd/conf/httpd.conf: Syntax error on line 6 of /etc/httpd/conf.d/php.conf: Cannot load modules/libphp5.so into server: /lib64/libresolv.so.2: symbol __h_errno, version GLIBC_PRIVATE not defined in file libc.s